Компьютерный форум
Правила
Вернуться   Компьютерный форум > Форум программистов > Программирование под Windows > Visual C++
Перезагрузить страницу При установки С++ выдает ошибку max.obj : error LNK2019
Ответ
 
Опции темы Опции просмотра
  (#1 (permalink)) Старый
imported_Jarl imported_Jarl вне форума
Новичок
 
Сообщений: 6
Сказал(а) спасибо: 0
Поблагодарили 0 раз(а) в 0 сообщениях
Регистрация: 28.03.2005
По умолчанию При установки С++ выдает ошибку max.obj : error LNK2019 - 14.04.2005, 06:58

Всем привет!
Поставил Visual Studio.NET.
Запускаю VC++, создаю с помощью мастера Win32 Project, делаю Build, получаю
Linking...
max.obj : error LNK2019: unresolved external symbol @_RTC_CheckStackVars@8 referenced in function _WinMain@16
max.obj : error LNK2019: unresolved external symbol __RTC_CheckEsp referenced in function _WinMain@16
max.obj : error LNK2001: unresolved external symbol __RTC_Shutdown
max.obj : error LNK2001: unresolved external symbol __RTC_InitBase
Debug/max.exe : fatal error LNK1120: 4 unresolved externals
--------------------------------------------------------------------------
Как же так ?!
Подскажите, что имправить.
Thanks all.
Ответить с цитированием
  (#2 (permalink)) Старый
imported_Jarl imported_Jarl вне форума
Новичок
 
Сообщений: 6
Сказал(а) спасибо: 0
Поблагодарили 0 раз(а) в 0 сообщениях
Регистрация: 28.03.2005
По умолчанию 14.04.2005, 21:59

??? Неужели никто не сталкивался?

Добавлю информации для описания проблемы:

Я создаю проект под Windows 32, не дописывая никакого кода, и сразу компилирую приложение. А в ответ получаю ерроры, которые указаны выше
Ответить с цитированием
  (#3 (permalink)) Старый
Влад Влад вне форума
Специалист
 
Сообщений: 3,884
Сказал(а) спасибо: 1
Поблагодарили 25 раз(а) в 25 сообщениях
Регистрация: 27.06.2002
Адрес: Санкт-Петербург
По умолчанию 15.04.2005, 13:27

Видно, действительно никто не сталкивался...
Цитата:
Originally posted by Jarl
[b]Я создаю проект под Windows 32, не дописывая никакого кода, и сразу компилирую приложение. А в ответ получаю ерроры, которые указаны выше.
С Delphi/Builder'а переходишь?

Опиши подробнее - какой проект, как создаешь, какие опции... Или выложи проект где-нибудь на FTP и дай ссылку. Первое впечатление, что не подключена библиотека времени выполнения.


The difference between theory and practice is that in theory, there is no difference between theory and practice, but in practice, there is.
Ответить с цитированием
  (#4 (permalink)) Старый
imported_Jarl imported_Jarl вне форума
Новичок
 
Сообщений: 6
Сказал(а) спасибо: 0
Поблагодарили 0 раз(а) в 0 сообщениях
Регистрация: 28.03.2005
По умолчанию 17.04.2005, 18:45

Да ... с builder переползаю...

Вот ссылка на проект http://vcproject.narod.ru/simple.rar
Ответить с цитированием
  (#5 (permalink)) Старый
Влад Влад вне форума
Специалист
 
Сообщений: 3,884
Сказал(а) спасибо: 1
Поблагодарили 25 раз(а) в 25 сообщениях
Регистрация: 27.06.2002
Адрес: Санкт-Петербург
По умолчанию 18.04.2005, 11:34

Цитата:
Originally posted by MSVC++ 7.1
[b]------ Rebuild All started: Project: simple, Configuration: Debug Win32 ------
Deleting intermediate files and output files for project 'simple', configuration 'Debug|Win32'.
Compiling...
stdafx.cpp
Compiling...
simple.cpp
Compiling resources...
Linking...

Build log was saved at "file://f:TmpsimpleDebugBuildLog.htm"
simple - 0 error(s), 0 warning(s)
---------------------- Done ----------------------
Rebuild All: 1 succeeded, 0 failed, 0 skipped
Что-то не так у тебя с установкой среды, видать...


The difference between theory and practice is that in theory, there is no difference between theory and practice, but in practice, there is.
Ответить с цитированием
Ads.
  (#6 (permalink)) Старый
BabyBear BabyBear вне форума
Member
 
Сообщений: 261
Сказал(а) спасибо: 0
Поблагодарили 0 раз(а) в 0 сообщениях
Регистрация: 09.04.2005
По умолчанию 18.04.2005, 19:49

Угу

/MACHINE:IX86
/MACHINE:X86

Project/Properties/ Configuration Properties/Linker/Advanced/TargetMachine
Ответить с цитированием
Ads
Ответ

Опции темы
Опции просмотра

Ваши права в разделе
Вы не можете создавать новые темы
Вы не можете отвечать в темах
Вы не можете прикреплять вложения
Вы не можете редактировать свои сообщения

BB коды Вкл.
Смайлы Вкл.
[IMG] код Вкл.
HTML код Выкл.
Trackbacks are Вкл.
Pingbacks are Вкл.
Refbacks are Выкл.


Похожие темы
Тема Автор Раздел Ответов Последнее сообщение
Как исправить ошибку error LNK2019 Зирк С/С++ 5 20.06.2011 22:34
При включении компьютер выдает ошибку CPU Voltage Error Irusik Техническая поддержка 13 05.03.2009 19:00
После установки программы Windows перестал загружаться, выдает ошибку: Runtime error. zhanna Любые вопросы от новичков 13 01.01.2009 18:44
При подключение к серверу выдает ошибку Error 500 vavan Вопросы начинающих программистов 2 23.08.2006 16:40
RasGetConnectionStatistics выдает ошибку error C2065 что делать zim Visual C++ 5 06.02.2006 21:31
Как исправить ошибку error LNK2019 & templates Rocky С/С++ 12 02.02.2006 13:12
WaveIn выдает ошибку as error LNK2019 что делать Kiston Visual C++ 1 24.04.2005 00:24
Компилятор выдает ошибку error: unable to open *.exe chizhan Visual C++ 2 29.10.2004 10:35
Компиляция выдает ошибку fatal error RC1015 buzz Visual C++ 0 15.07.2004 12:30
Win API выдает ошибку: error C2051 что делать Profan Visual C++ 7 21.04.2004 13:56
При компиляции выдает ошибку link error Anonymous Visual C++ 1 17.11.2003 18:40
PlaySound выдает ошибку error LNK2001 sCandal Visual C++ 1 14.11.2003 11:31



Powered by vBulletin® Version 3.8.7
Copyright ©2000 - 2018, Jelsoft Enterprises Ltd.
Нardforum.ru - компьютерный форум и программирование, форум программистов